﻿_id,KECAMATAN,PUSKESMAS,KELURAHAN,Nama Balita,L/P,Tgl. Lahir,Tgl Pengukuran,Umur (bln),BB (Kg),Tb (cm),Status Gizi PB/TB/U,Status Gizi BB/U,Status Gizi BB/TB,Nama Ortu,Kartu Keluarga,Pekerjaan,Alamat KK,Alamat tempat tinggal,Penghasilan (Tinggi/Menengah/Rendah),Penerima Bantuan PKH(Ya/Tidak),Penerima Bantuan BPNT(Ya/Tidak),JAMINAN KESEHATAN NASIONAL (JKN) (MANDIRI/PENERIMA UPAH/PNS/PBI,STATUS RUMAH (MILIK SENDIRI/SEWA/MENUMPANG),KONDISI RUMAH (SEHAT/TIDAK SEHAT),SANITASI (LAYAK/TIDAK LAYAK),SUMBER AIR MINUM (PDAM/AIR TANAH/AIR KEMASAN)
1,Medan Tuntungan,Tuntungan,Baru Ladang Bambu,Kirana Ayumna,P,20-10-2019,18-08-2021,21,10.300000000000000710542735760100185871124267578125,73,sgt pendek,normal,resk lbh,rahmawati sbrg,1275106010199076,brh bangunan,jl.b.kardiol,jl.b.kardiol,Rendah,Tidak,Tidak,Tidak Ada,Sewa,Sehat,ada,air tanah
2,"","","",Virena,P,43895.0,44538.0,15,8,72,pendek,kurang,baik,Evolani,"""1275100305204378",br bangunan,jl.pariama II,jl.pariama II,Rendah,Tidak,Tidak,Tidak Ada,Sewa,Tidak Sehat,ada,air tanah
3,"","",NAMO GAJAH,Marisa Natania,P,43928.0,16-08-2021,13,8.199999999999999289457264239899814128875732421875,69,pendek,kurang,baik,Nani Sari,"""1275104407207140",buruh,jl.petunia,jl.petunia,Rendah,Tidak,Tidak,Tidak Ada,Menumpang,Sehat,ada,air tanah
4,"","","",Chrisdean  Xander Gulo,L,27/09/17,16/08/2021,46,11.9000000000000003552713678800500929355621337890625,91,pendek,kurang,baik,Aris Gulo,"""1271072709170001",bangunan,jl.petunia raya,jl.petunia raya,Rendah,Tidak,Tidak,mandiri,Sewa,Sehat,ada,Air Tanah
5,"","",Sidomulyo,Aqila Syafania,P,24-07-2020,20-08-2021,1,8,67,sgt pendk,normal,baik,Maisarah,"""121105670720001",bangunan,jl.bunga turi I,jl.bunga turi I,Rendah,Tidak,Tidak,Tidak Ada,sewa,Sehat,  ,air tanah
6,"","",Kemenangan Tani,Boy Nuradi,L,42923.0,16-08-2021,49,13,93,pendek,normal,baik,Rahmadani,"""1271070707170003",supir,seroja raya no 150(S.O.S),seroja raya no 150(S.O.S),Rendah,Tidak,Tidak,Tidak Ada,Panti asuhan,Sehat,ada,air tanah
7,"","","",Cristo Jadon S,L,14/10/19,44447.0,21,9.699999999999999289457264239899814128875732421875,78,sgt pdk,kurang,baik,Melda,1271071410190004,buruh,jl.flamboyan lk V,Jl.flamboyan lk V,Rendah,Tidak,Tidak,penerima,Menumpang,sehat,ada,air tanah
8,"","","",CristianJabin S,L,14/10/19,44447.0,21,8.5999999999999996447286321199499070644378662109375,74,pendek,kurang,baik,Melda,"""1271071410190003",buruh,jl.flamboyan lk V,Jl.flamboyan lk V,Rendah,Tidak,Tidak,penerima,Menumpang,Sehat,ada,air tanah
9,"","",Tanjung Selamat,Julpita,P,43253.0,44447.0,42,9.5,87.5,pendek,sgt krg,kurang,Meniadi,"""1275104602187809",buruh,jl.flamboyan raya,jl.flamboyan raya,Rendah,Tidak,Tidak,Tidak Ada,sewa,Tidak Sehat,ada,air tanah
10,"","","",Gabriel,L,17-09-2019,44447.0,22,10,76.5,sgt pendek,normal,baik,Ana Mulia Laia,"""1275101709199627",buruh,jl.flamboyan raya,jl.flamboyan raya,Rendah,Tidak,Tidak,Tidak Ada,sewa,Tidak Sehat,ada,air tanah
11,"","","","","","","",,,,"","","","","","","","","","","","","","","",""
12,"","","","","","","",,,,"","","","","","","","Medan,  Oktober 2020","","","","","","","",""
13,"","","","","","","",,,,"","","","","","","",Yang membuat laporan,"","","","","","","",""
14,"","","","","","","",,,,"","","","","","","",Tenaga Pelaksana Gizi Puskesmas,"","","","","","","",""
15,"","","","","","","",,,,"","","","","","","","","","","","","","","",""
16,"","","","","","","",,,,"","","","","","","","","","","","","","","",""
17,"","","","","","","",,,,"","","","","","","","Repia Samosir,AMG","","","","","","","",""
18,"","","","","","","",,,,"","","","","","","",NIP.19680911 198911 2 001,"","","","","","","",""
