﻿_id,KELURAHAN,NAMA BALITA,(L/P),TGL LAHIR,TGL PENGUKURAN,UMUR (BLN),BB (KG),TB (CM),STATUS GIZI PB/TB/U,STATUS GIZI BB/U,STATUS GIZI BB/TB,NAMA ORANG TUA,KARTU KELUARGA,KTP (MEDAN/ LUAR MEDAN),PEKERJAAN,ALAMAT KK,ALAMAT TEMPAT TINGGAL,PENGHASILAN (TINGGI/ MENENGAH/ RENDAH),PENERIMA BANTUAN PKH (YA/TIDAK),PENERIMA BANTUAN BPNT (YA/TIDAK),JAMINAN KESEHATAN NASIONAL (JKN) (MANDIRI/PENERIMA UPAH/PNS/PBI,STATUS RUMAH (MILIK SENDIRI/SEWA/MENUMPANG),KONDISI RUMAH (SEHAT/TIDAK SEHAT),SANITASI (LAYAK/TIDAK LAYAK),SUMBER AIR MINUM (PDAM/AIR TANAH/AIR KEMASAN)
1,Kampung Baru,Niarbetty,P,42982,44431,46,11.699999999999999289457264239899814128875732421875,93,Pendek,Normal,Baik,Ujang Aman/Asmaniar,1271151510140008,MEDAN,Sopir,Gg. Amir No. 15,Gg. Amir No. 15,RENDAH,Tidak,TIDAK,PBI,Menumpang,TIDAK SEHAT,SEHAT,Air Tanah
2,Kampung Baru,Raisal Affandi,L,42753,44431,52,11.5,93,Sgt Pendek,Normal,Kurang,Linda Syafitri/Doli Lubis,,LUAR MEDAN,Mocok-mocok,Sidempuan,Gg. Lampu I Lk. 16,RENDAH,Tidak,TIDAK,PBI,Sewa,TIDAK SEHAT,TIDAK LAYAK,Air Tanah
3,Kampung Baru,Siti Akila,P,42930,44431,47,11,88,Sgt Pendek,Sgt Kurang,Baik,Rinta Berutu/Roby Ertanto,1271153001180006,MEDAN,Karyawan swata,Gg Lampu I,Gg Lampu I,RENDAH,Tidak,TIDAK,MANDIRI,Sewa,TIDAK SEHAT,SEHAT,PDAM
4,Kampung Baru,Muhammad Arka,L,42575,44431,59,12.5,98,Pendek,Kurang,Baik,Kaharuddin/Anita Purnama Sari ,127115220807010,MEDAN,Tukang becak,Gg. Lampu  I No. 38,Gg. Lampu  I No. 38,RENDAH,Tidak,TIDAK,PBI,Sewa,SEHAT,SEHAT,PDAM
5,Kampung Baru,Mhd Al khafi,L,42789,44431,51,12.5,94,Pendek,Kurang,Kurang,Artika,1271151608830004,MEDAN,Kuli bangunan,Gg. Rela,Gg. Rela,RENDAH,Tidak,TIDAK,PBI,Sewa,SEHAT,TIDAK LAYAK,PDAM
6,Kampung Baru,Nazira Alya Lubis,P,43483,44431,30,11,83,Pendek,Normal,Baik,Linda Syafitri/Doli Lubis,,LUAR MEDAN,Mocok-mocok,Sidempuan,Gg. Lampu I Lk. 16,RENDAH,Tidak,TIDAK,PBI,Sewa,TIDAK SEHAT,LAYAK,Air Tanah
7,Kampung Baru,Azzam Fahri,L,43166,44431,39,10,90,Pendek,Sgt Kurang,Buruk,Mansyahril/Lidiana,1271152204160005,MEDAN,Karyawan toko,Gg. Melur No. 42,Gg. Melur No. 43,RENDAH,Tidak,TIDAK,PBI,Sewa,TIDAK SEHAT,TIDAK LAYAK,PDAM
8,Kampung Baru,Fikri Maulana,L,43059,44431,43,11.800000000000000710542735760100185871124267578125,85,Sgt Pendek,Kurang,Baik,Septian Hernanto/Laila Khalid,1271151409150008,MEDAN,Jualan,Gg. Kenangan No. 72,Gg. Kenangan No. 72,RENDAH,Tidak,TIDAK,Tdk ada,Sewa,SEHAT,TIDAK LAYAK,Air Tanah
9,Kampung Baru,Sakila,P,43877,44431,28,8.5,70,Sgt Pendek,Sgt Kurang,Baik,Abdul Rafiq/Iva Sulastri Nasution,1271150207180001,MEDAN,Mocok-mocok,Jl. B. Katamso Gg. Mesjid No. 60,Jl. B. Katamso Gg. Mesjid No. 60,RENDAH,Tidak,TIDAK,Tdk ada,Menumpang,SEHAT,TIDAK LAYAK,Air Tanah
10,Kampung Baru,Siti Aisyah,P,42602,44431,58,11.5,91,Pendek,Normal,Baik,Budi Satria/Fitriany,1271150208170003,MEDAN,Kuli bangunan,Gg. Jawa No. 46,Gg. Jawa No. 46,RENDAH,Tidak,TIDAK,Tdk ada,Menumpang,SEHAT,TIDAK LAYAK,Air Tanah
11,Kampung Baru,Arumi Chayra Aulia,P,43488,44431,29,9.5,86,Normal,Kurang,Kurang,Fahril Aulia/Evinawati,1271150308150002,MEDAN,karyawan bengkel,Jln. Pasar Senen Lembah No. 1,Jln. Pasar Senen Lembah No. 1,RENDAH,Tidak,TIDAK,Tdk ada,Menumpang,SEHAT,TIDAK LAYAK,Air Tanah
12,Kampung Baru,Naura Syafitri,P,43284,44431,39,10,83,Sgt Pendek,Kurang,Baik,Fahmi Suwanda/Novi Fitri,,"",Tukang parkir,Gg. Lori No. 47,Gg. Lori No. 47,RENDAH,Tidak,TIDAK,Tdk ada,Menumpang,SEHAT,TIDAK LAYAK,Air Tanah
13,Kampung Baru,Nur Rahma Swandi,P,43108,44431,43,14,91,Pendek,Normal,Baik,Swandi/Ratna,,MEDAN,Mocok-mocok,Gg. Subur ,Gg. Subur ,RENDAH,Tidak,TIDAK,Tdk ada,Menumpang,TIDAK SEHAT,TIDAK LAYAK,PDAM
14,Sei Mati,Fatimah Az zahra,P,43272,44432,36,9.5,86,Pendek,Sgt Kurang,Kurang,Yudi Apriano/Chairunnisa,1271150903110006,MEDAN,Karyawan swata,Gg. Nasional ,Gg. Nasional ,RENDAH,Tidak,TIDAK,PBI,Menumpang,TIDAK SEHAT,TIDAK LAYAK,PDAM
15,Sei Mati,Kurnia Shah Harumi,P,42646,44432,57,13,95,Pendek,Kurang,Baik,Bambang/Yenni,1271151812120001,MEDAN,Tukang ojek, Gg Perwira No. 52, Gg Perwira No. 52,RENDAH,Tidak,TIDAK,PBI,sendiri,TIDAK SEHAT,TIDAK LAYAK,Air Tanah
16,Sei Mati,Alisya Salsabila,P,42875,44432,49,11,87,Sgt Pendek,Sgt Kurang,Baik,Suryadi/Mahdalena,,MEDAN,Tukang jahit sepatu,Gg. Kasih,Gg. Kasih,RENDAH,Tidak,TIDAK,Tdk ada,Menumpang,SEHAT,TIDAK LAYAK,PDAM
17,Sei Mati,Shifanny Ar Ray Tanjung,P,43584,44432,26,8.5,70,Sgt Pendek,Kurang,Baik,Fattahul Amin. T/Sri Ramadhani,,MEDAN,Tukang becak,Gg. Kesatria No. 7,Gg. Kesatria No. 7,RENDAH,Tidak,TIDAK,Tdk ada,Menumpang,TIDAK SEHAT,TIDAK LAYAK,Air Tanah
18,Sei Mati,M. Khabib,L,43376,44432,33,10.300000000000000710542735760100185871124267578125,81,Pendek,Kurang,Baik,Rahmi Pulungan/Safri Majid,1271152711170001,MEDAN,Mocok-mocok,Gg. Bidan,Gg. Bidan,RENDAH,Tidak,TIDAK,Tdk ada,Menumpang,TIDAK SEHAT,TIDAK LAYAK,Air Tanah
19,Sei Mati,M. Rizki Ramadhan,L,42906,44432,48,12.300000000000000710542735760100185871124267578125,82,Pendek,Kurang,Baik,Ajo Anas/Sri Rezeki,,MEDAN,Tukang parkir,Gg. Abadi No. 34,Gg. Abadi No. 34,RENDAH,Tidak,TIDAK,Tdk ada,Sewa,TIDAK SEHAT,TIDAK LAYAK,PDAM
20,Sei Mati,Adiba Kanza Zahra,P,43038,44432,44,12,90,Pendek,Kurang,Baik,Romilus/Risti Ayu,1271150610200006,MEDAN,Jualan,Gg. Nasional ,Gg. Nasional ,RENDAH,Tidak,TIDAK,Tdk ada,Sendiri,TIDAK SEHAT,TIDAK LAYAK,PDAM
21,Sei Mati,Muamar Latif,L,43585,44432,26,10,75,Sgt Pendek,Normal,Baik,Ludiansyah/Lia Saputri,,MEDAN,Penggali Kubur,Gg. Perwira No. 95,Gg. Perwira No. 95,RENDAH,Tidak,TIDAK,Tdk ada,Menumpang,TIDAK SEHAT,TIDAK LAYAK,PDAM
22,Sei Mati,Haikal Ahmad Zidan,L,42634,44432,46,13.5,96,Pendek,Kurang,Baik,Andi Syahputra/Wezi Afriza,1271156504960002,MEDAN,Mocok-mocok,Sukaraja,Gg. Rakyat Sei mati,RENDAH,Tidak,TIDAK,Tdk ada,Sendiri,TIDAK SEHAT,TIDAK LAYAK,Air Tanah
23,Sei Mati,Kaila Putri Arafah,P,42980,44432,47,8,84,Sgt Pendek,Sgt Kurang,Buruk,Andi Syahputra/Wezi Afriza,1271156504960002,MEDAN,Mocok-mocok,Sukaraja,Gg. Rakyat Sei mati,RENDAH,Tidak,TIDAK,Tdk ada,Sendiri,TIDAK SEHAT,TIDAK LAYAK,Air Tanah
24,Sei Mati,BilqisAzura,P,43563,44432,28,9.199999999999999289457264239899814128875732421875,77,Sgt Pendek,Kurang,Baik,Andi Syahputra/Wezi Afriza,1271156504960002,MEDAN,Mocok-mocok,Sukaraja,Gg. Rakyat Sei mati,RENDAH,Tidak,TIDAK,Tdk ada,Sendiri,TIDAK SEHAT,TIDAK LAYAK,Air Tanah
25,Sei Mati,Inhdzen Alfarizi,L,43580,44432,28,10,76,Sgt Pendek,Kurang,Baik,Dahni Saputra/Sri Fadila,,MEDAN,Buruh,GG. Kesatria,GG. Kesatria,RENDAH,Tidak,TIDAK,Tdk ada,Sewa,TIDAK SEHAT,TIDAK LAYAK,Air Tanah
26,Sei Mati,Razak,L,43671,44432,25,9,76,Sgt Pendek,Kurang,Baik,Lukman Harun/Nurdiana,,MEDAN,Pedagang Asongan,GG. Kesatria,GG. Kesatria,RENDAH,Tidak,TIDAK,Tdk ada,Sewa,TIDAK SEHAT,TIDAK LAYAK,Air Tanah
27,Sukaraja,Afif hamizan,L,43080,44433,43,11.5,90,Pendek,Kurang,Baik,Indrawardi/agustia,1271151608830004,MEDAN,Kuli bangunan,Gg Warni Sukaraja,Gg Warni Sukaraja,RENDAH,Tidak,TIDAK,PBI,Sewa,TIDAK SEHAT,TIDAK LAYAK,Air Tanah
28,Sukaraja,Rafael Darmawan,L,42928,44433,58,11,87,Sgt Pendek,Sgt Kurang,Baik,Odaligu Waruwu/Putri,1271151812120001,MEDAN,Karyawan swata,Jl. Warni No. 67. C,Jl. Warni No. 67. C,RENDAH,Tidak,TIDAK,MANDIRI,Sewa,TIDAK SEHAT,TIDAK LAYAK,Air Tanah
29,Sukaraja,Davian,L,43943,44433,15,7,69,Pendek,Kurang,Baik,Andi Prayogi/Netty Ramadhani,1271152402210001,MEDAN,Kuli bangunan,Gg. Sederhana No. 27,Gg. Sederhana No. 27,RENDAH,Tidak,TIDAK,PBI,Sewa,SEHAT,LAYAK,PDAM
30,Jati,Zein malik Alhafis,L,42756,44433,53,11,93,Pendek,Sgt Kurang,Kurang,Habib/Apriliany,,MEDAN,Kuli bangunan,Jl. Samanhudi Lk. III,Jl. Samanhudi Lk. III,RENDAH,Tidak,TIDAK,PBI,Menumpang,SEHAT,SEHAT,PDAM
31,Jati,Aisyah Putri Syaban,P,43552,44433,28,9.300000000000000710542735760100185871124267578125,80,Pendek,Kurang,Baik,Abdul/Mariani,,MEDAN,Kuli bangunan,Jl. Samanhudi Lk. III,Jl. Samanhudi Lk. III,RENDAH,Tidak,TIDAK,Tdk ada,Menumpang,SEHAT,SEHAT,PDAM
32,Aur,Kezira,P,42760,44433,53,12,89,Sgt Pendek,Kurang,Baik,Fadilla,,MEDAN,Diver ojek online,Jl. Kampung Aur,Jl. Kampung Aur,RENDAH,Tidak,TIDAK,Tdk ada,Sewa,TIDAK SEHAT,TIDAK LAYAK,PDAM
33,Aur,Chelsi,P,42644,44433,56,11,93,Sgt Pendek,Sgt Kurang,Kurang,Chairul /Fatma,1271150907070015,MEDAN,Jualan,JL B. Katamso  dalam,JL B. Katamso  dalam,RENDAH,Tidak,TIDAK,PBI,Menumpang,SEHAT,TIDAK LAYAK,PDAM
34,Aur,Khairunnisa,P,43186,44433,39,10.5999999999999996447286321199499070644378662109375,96,Pendek,Normal,Baik,Taufik/Ayu,1271150812170005,MEDAN,Tukang parkir,Jl. Kp Aur No. 3B,Jl. Kp Aur No. 3B,RENDAH,Tidak,TIDAK,PBI,Menumpang,TIDAK SEHAT,LAYAK,PDAM
35,Aur,Azka Makhaila,P,43018,44433,44,10.199999999999999289457264239899814128875732421875,90,Pendek,Sgt Kurang,Kurang,Lilik Anshori/Santi,1271150703050002,MEDAN,Petuga sampah,Jl. Kp Aur No. 4,Jl. Kp Aur No. 4,RENDAH,Tidak,TIDAK,PBI,Menumpang,TIDAK SEHAT,TIDAK LAYAK,PDAM
36,Aur,Arumi Farhana,P,43378,44433,33,11.4000000000000003552713678800500929355621337890625,92,Pendek,Normal,Baik,Juliani/Heru Hidayat,127115059180006,MEDAN,Kuli bangunan,Jl. B. Katamso No. 2E,Jl. B. Katamso No. 2E,RENDAH,Tidak,TIDAK,PBI,Sewa,SEHAT,TIDAK LAYAK,PDAM
37,Aur,Albyansyah Haikal Sagala,L,43846,44433,19,8,79,Normal,Kurang,Buruk,Abdul Muthalib/Fenny,,MEDAN,Mocok-mocok,Jl. Mangkubumi,Jl. Mangkubumi,RENDAH,Tidak,TIDAK,PBI,Sewa,TIDAK SEHAT,TIDAK LAYAK,PDAM
38,Aur,Lena,P,43784,44433,21,8.5,72,Sgt Pendek,Normal,Baik,Aldi/Sri Wahyuni,,MEDAN,Mocok-mocok,Jl. Sukamulia,Jl. Sukamulia,RENDAH,Tidak,TIDAK,PBI,Sewa,TIDAK SEHAT,TIDAK LAYAK,PDAM
39,Hamdan,Alif Ardiansyah,L ,43083,44433,43,12.300000000000000710542735760100185871124267578125,90,Pendek,Normal,Baik,Zulfikar/Mayang Sari,1271151403070020,MEDAN,Karyawan swata,Jl. Badur Bawah no. 28 A,Jl. Badur Bawah no. 28 A,RENDAH,Tidak,TIDAK,PBI,Sewa,TIDAK SEHAT,SEHAT,Air Tanah
40,Hamdan,Dava Adya Tama,L,43438,44433,31,10.5,78,Sgt Pendek,Normal,Baik,Suhendra/Susan,1271150107930001,MEDAN,Kuli bangunan,Jl. Multatuli Lk. 4 No. 41,Jl. Multatuli Lk. 4 No. 41,RENDAH,Tidak,TIDAK,PBI,Menumpang,SEHAT,LAYAK,Air Tanah
41,"","","",,,,,,"","","","",,"","","","","","","","","","","",""
42,"","","",,,,,,"","","","",,"","","","","Medan, September 2021","","","","","","",""
43,Diketahui Oleh:,"","",,,,,,"","","","",,"","","","",Yang Membuat Laporan,"","","","","","",""
44,Kepala UPT Puskesmas Kampung Baru,"","",,,,,,"","","","",,"","","","",TPG Puskesmas Kampung Baru,"","","","","","",""
45,"","","",,,,,,"","","","",,"","","","","","","","","","","",""
46,"","","",,,,,,"","","","",,"","","","","","","","","","","",""
47,                                                                                                                                     ,"","",,,,,,"","","","",,"","","","","","","","","","","",""
48,     dr. Erwina Zaini,"","",,,,,,"","","","",,"","","","",     Lisbet Situmorang,"","","","","","",""
49,NIP.19700708 200212 2 001,"","",,,,,,"","","","",,"","","","",NIP.1969 0704 1994 03 2007,"","","","","","",""
