﻿_id,Nama Balita,L/P,Tgl. Lahir,Tgl Pengukuran,Umur (bln),BB (Kg),Tb (Cm),Status Gizi PB/TB/U,Status Gizi BB/U,Status Gizi BB/TB,Nama Ortu,Kartu Keluarga,Pekerjaan,Alamat KK,Alamat tempat tinggal,Lingkungan,BPJS,Buku KIA,Jamban/septik Tank,Sarana Air Bersih,Sarana Air Minum,Ket
1,Syahfa Marwa Salsabila,P,43074.0,44427,44,13,90.5,Pendek,Normal,Baik,Muhammad Rais,127119303180010,Wiraswasta,Jl. G. Subroto Gg. Mesjid 13,Jl. G. Subroto Gg. Mesjid 14,X SKD,√,√,√,√,√,""
2,Nurul Aulia,P,43138.0,44432,42,12.199999999999999289457264239899814128875732421875,94,Pendek,Kurang,Baik,Ariyadi,1271190111170005,Wiraswasta,Jl. Gajahmada No 22,Jl. Gajahmada No 22,VI SKD,√,√,√,√,√,""
3,Febi Yunisa,P,43147.0,44410,42,10,88,Pendek,Kurang,Kurang,Yudi Wardana,1271192804150012,Wiraswasta,Jl. Tinta,jl. Tinta,XI SPB,-,√,√,√,√,""
4,M. Reihan,L,43291.0,44418,37,10,84.5,Sangat Pendek,sangat kurang,Baik,Misbah Khairani,1271190507060011,IRT,Jl. Buku No 10A,Jl. Buku No 10A,VII SPB,-,-,√,√,√,""
5,Haziq Al Athaya,L,31/8/2018,44411,36,9.699999999999999289457264239899814128875732421875,86,Pendek,sangat kurang,Kurang,Nurmila,1271192503090010,IRT,Jl. Jangka No.53A,Jl. Jangka No. 53A,III SPB,-,√,√,√,√,""
6,Athala,L,24/2/2019,44410,29,11,81.5,Pendek,Normal,Baik,Diyah,1271192803180004,IRT,Jl. Tinta 41,Jl. Tinta 42,XI SPB,√,√,√,√,√,""
7,Aviva Umma Hayroh,P,29/9/2019,44424,23,7.20000000000000017763568394002504646778106689453125,76.5,Pendek,sangat kurang,Buruk,Joko Santoso,1271190210120004,Wiraswasta,jl. TTp. Gg. Seri No 5,jl. TTp. Gg. Seri No 6,XI  SKD,-,-,√,-,√,""
8,"","","",,,,,"","","","",,"","","","","","","","","",""
9,Diketahui :,"","",,,,,"","","","",,"","","Medan,           Agustus 2021","","","","","","",""
10,Kepala Puskesmas Darussalam,"","",,,,,"","",  ,"",,"","",TPG Puskesmas Darussalam,"","","","","","",""
11,"","","",,,,,"","","","",,"","","","","","","","","",""
12,"","","",,,,,"","","","",,"","","","","","","","","",""
13,"","","",,,,,"","","","",,"","","","","","","","","",""
14,drg. HENNY SAVITRI,"","",,,,,"","","","",,"","","Paridah Hanim, AMG","","","","","","",""
15,NIP. 19700720 200502 2 004,"","",,,,,"","","","",,"","",NIP. 19681121 198911 2 001,"","","","","","",""
