﻿_id,KECAMATAN,PUSKESMAS,KELURAHAN,NAMA BALITA,JENIS KELAMIN (L/P),TGL LAHIR,TGL PENGUKURAN,UMUR (BLN),BB (KG),TB (CM),STATUS GIZI PB/TB/U,STATUS GIZI BB/U,STATUS GIZI BB/TB,NAMA ORANG TUA,KARTU KELUARGA,KTP (MEDAN/ LUAR MEDAN),PEKERJAAN,ALAMAT KK,ALAMAT TEMPAT TINGGAL,PENGHASILAN (TINGGI/ MENENGAH/ RENDAH),PENERIMA BANTUAN PKH (YA/TIDAK),PENERIMA BANTUAN  BPNT (YA/TIDAK),JAMINAN KESEHATAN NASIONAL (JKN) (MANDIRI/PENERIMA UPAH/PNS/PBI,STATUS RUMAH (MILIK SENDIRI/SEWA/MENUMPANG),KONDISI RUMAH (SEHAT/TIDAK SEHAT),SANITASI (LAYAK/TIDAK LAYAK),SUMBER AIR MINUM (PDAM/AIR TANAH/AIR KEMASAN)
1,Medan Denai,Tegal Sari,Tegal Sari Mandala 3,M. Haikal Azril,L,4 Oktober 2018 ,16 Agutus 2021,34 Bulan,7,80,Sangat Pendek,Sangat Kurang,Gizi Buruk,Azhar Nasution,1271040901150020,MEDAN,Membuat pelaminan,Jl Rawa Cangkuk IV Gg Pakpak,Jl Rawa Cangkuk IV Gg Pakpak,2.500.0000,Ya,TIDAK,Tidak Ada,Sewa,Sehat, Layak,U
2,Medan Denai,Tegal Sari,Tegal Sari mandala 3,Aira Nur Humaira,P,19 Februari 2019,16 Agutus 2021,29 Bulan,9,81,Pendek,Sangat Kurang,Gizi Baik,Jurmis,1271042908180008,MEDAN,Jualan mainan,Jln Rawa Cangkuk Gg Pembangunan No 17 ,Jln Rawa Cangkuk Gg Pembangunan No 17 ,1.500.0000,Ya,TIDAK,Tidak Ada,Rumah sendiri,Sehat,Tidak Layak,Air Tanah
3,Medan Denai,Tegal Sari,Tegal Sari mandala 3,Andra Nur Alfian Pulungan,L,20 Mei 2017,16 Agutus 2021,50 Bulan,11,93,Pendek,Sangat Kurang,Gizi Baik,Jurmis,1271042908180008,MEDAN,Jualan mainan,Jln Rawa Cangkuk Gg Pembangunan No 17 ,Jln Rawa Cangkuk Gg Pembangunan No 17 ,1.500.0000,Ya,TIDAK,Tidak Ada,Rumah sendiri,Sehat,Tidak Layak,Air Tanah
4,Medan Denai,Tegal Sari,Tegal Sari mandala 3,Rainda Azaria,P,25 November 2017,10 Agustus 2021,44 Bulan,11,90.5,Pendek,BB Sangat Kurang,Gizi Baik,Yessi Yuliani,1271040601160006,MEDAN,Menjual Barang Bekas  (Botot),Jl. Rawa II GG Tani No 4,Jl. Rawa II GG Tani No 4,1.500.0000,Ya,TIDAK,YA,Rumah sendiri,Sehat,Tidak Layak,Air Tanah
5,Medan Denai,Tegal Sari,Tegal Sari Mandala 3,Cahaya Amira,P,28 April 2021,18 Agustus 2021,39 Bulan,10,83.5,"","","","",,"","","","","","","","","","","",""
6,Medan Denai,Tegal Sari,Tegal Sari Mandala 3,Adiba Salwa,P,"","","",,,"","","","",,"","","","","","","","","","","",""
7,"","","","","","","","",,,"","","","",,"","","","","","","","","","","",""
8,"","","","","","","","",,,"","","","",,"","","","","","","","","","","",""
9,Mengetahui :,"","","","","","","",,,"","","","",,"","","","","","","","","","","",""
10,Kepala Puskesmas Tegal Sari,"","","","","","","",,,"","","","",,"","","","","","","",TPG Puskesmas Tegal Sari,"","","",""
11,"","","","","","","","",,,"","","","",,"","","","","","","","","","","",""
12,"","","","","","","","",,,"","","","",,"","","","","","","","","","","",""
13,"dr. Hj. Ernasari Hasibuan, M.Kes","","","","","","","",,,"","","","",,"","","","","","","",Juy Novita Sagala,"","","",""
14,NIP. 19640508 200212 2 001,"","","","","","","",,,"","","","",,"","","","","","","",NIP. 19880728 201403 2 003,"","","",""
