﻿_id,KELURAHAN,NAMA BALITA,JENIS KELAMIN (L/P),TGL LAHIR,TGL PENGUKURAN,UMUR (BLN),BB (KG),TB (CM),STATUS GIZI PP/TB/U,STATUS GIZI BB/U,STATUS GIZI BB/TB,NAMA ORANG TUA,KARTU KELUARGA,KTP (MEDAN/ LUAR MEDAN),PEKERJAAN,ALAMAT KK,ALAMAT TEMPAT TINGGAL,PENGHASILAN (TINGGI/ MENENGAH/ RENDAH),PENERIMA BANTUAN PKH (YA/TIDAK),PENERIMA BANTUAN BPNT (YA/TIDAK),JAMINAN KESEHATAN NASIONAL (JKN) (MANDIRI/PENERIMA UPAH/PNS/PBI,STATUS RUMAH (MILIK SENDIRI/SEWA/MENUMPANG),KONDISI RUMAH (SEHAT/TIDAK SEHAT),SANITASI (LAYAK/TIDAK LAYAK),SUMBER AIR MINUM (PDAM/AIR TANAH/AIR KEMASAN),KET
1,Teladan Barat,Rahul Gilbert Yosafat ,L,2018-11-26T00:00:00,21 mei  21,34,11.699999999999999289457264239899814128875732421875,91,Pendek,Kurang,Baik,Sangkot Simangunsong,1271012909160007,MEDAN,Mocok-mocok,Sm raja G angkir  No 18F,Gg. Amir No. 15,RENDAH,Tidak,TIDAK,PBI,Menumpang,TIDAK SEHAT,SEHAT,PDAM,""
2,"","","",,"",,,,"","","","","","","","","","","","","","","","","",""
3,"","","",,"",,,,"","","","","","","","","","","","","","","","","",""
4,"","",Diketahui Oleh :,,"",,,,"","","","","Medan,    September  2021","","","","","","","","","","","","",""
5,"","",Kepala Puskesmas Teladan,,"",,,,"","","","",TPG Puskesmas Teladan,"","","","","","","","","","","","",""
6,"","","",,"",,,,"","","","","","","","","","","","","","","","","",""
7,"","","",,"",,,,"","","","","","","","","","","","","","","","","",""
8,"","",dr. Kus Puji Astuti,,"",,,,"","","","","Ruth Isabella . S, A.MG","","","","","","","","","","","","",""
9,"","",NIP. 196802161996032001,,"",,,,"","","","",NIP. 198908062011012009,"","","","","","","","","","","","",""
